BDBM50372779 CHEMBL271282
SMILES O=C(Nc1ccc(cc1)-n1ccnc1)C1C(=O)NCC(Cc2ccccc2)C1=O
InChI Key InChIKey=BCJOANYSQDRIOG-UHFFFAOYSA-N
Data  1 IC50
  Tab Delimited (TSV)   2D SDfile   Computed 3D by Vconf -m prep SDfile
Find this compound or compounds like it in BindingDB:
Activity Spreadsheet -- Enzyme Inhibition Constant Data from BindingDB
Found 1 hit for monomerid = 50372779
TargetIsoprenyl transferase(Streptococcus pneumoniae)
Novartis Institutes For Biomedical Research
Curated by ChEMBL
LigandPNGBDBM50372779(CHEMBL271282)
Affinity DataIC50:  8.80E+3nM. Assay description: Inhibition of Streptococcus pneumoniae UPPS
In DepthDetails ArticlePubMed